Target
M-phase inducer phosphatase 3
Ligand
BDBM50080993
Substrate
Meas. Tech.
ChEBML_49191
IC50
>2000000±n/a nM
Citation
 Blanchard, JLEpstein, DMBoisclair, MDRudolph, JPal, K Dysidiolide and related gamma-hydroxy butenolide compounds as inhibitors of the protein tyrosine phosphatase, CDC25. Bioorg Med Chem Lett 9:2537-8 (1999)  
Target
Name:
M-phase inducer phosphatase 3
Synonyms:
CDC25C M-phase inducer phosphatase 3 | MPIP3_HUMAN
Type:
Substrate
Mol. Mass.:
53366.11
Organism:
Homo sapiens (Human)
Description:
P30307
Residue:
473
  
Inhibitor
Name:
BDBM50080993
Synonyms:
(S)-5-Hydroxy-4-{(R)-1-hydroxy-2-[(1S,2S,5S,8aR)-1,2,5,8a-tetramethyl-5-(4-methyl-pent-4-enyl)-1,2,3,5,6,7,8,8a-octahydro-naphthalen-1-yl]-ethyl}-5H-furan-2-one | CHEMBL87951
Type:
Small organic molecule
Emp. Form.:
C26H40O4
Mol. Mass.:
416.5934
SMILES:
C[C@H]1CC=C2[C@@](C)(CCCC(C)=C)CCC[C@]2(C)[C@@]1(C)C[C@@H](O)C1=CC(=O)O[C@@H]1O
: