Target
Deoxyhypusine hydroxylase
Ligand
BDBM50525976
Substrate
Meas. Tech.
ChEMBL_1898739 (CHEMBL4400854)
IC50
5000±n/a nM
Citation
 Jiang, ZYou, QZhang, X Medicinal chemistry of metal chelating fragments in metalloenzyme active sites: A perspective. Eur J Med Chem 165:172-197 (2019)  
Target
Name:
Deoxyhypusine hydroxylase
Synonyms:
1.14.99.29 DOHH_HUMAN Deoxyhypusine hydroxylase HEAT-like repeat-containing protein 1 Synonyms=HLRC1 | hDOHH
Type:
PROTEIN
Mol. Mass.:
32886.24
Organism:
Homo sapiens
Description:
ChEMBL_119191
Residue:
302
  
Inhibitor
Name:
BDBM50525976
Synonyms:
APO-066 CHEBI:68554 CP20 DN-18001AF Ferriprox L1 PL1
Type:
Small organic molecule
Emp. Form.:
C7H9NO2
Mol. Mass.:
139.1519
SMILES:
Cc1c(O)c(=O)ccn1C
: