Target
rRNA adenine N-6-methyltransferase
Ligand
BDBM50081278
Substrate
Meas. Tech.
ChEMBL_67535 (CHEMBL679972)
Ki
75000±n/a nM
Citation
 Hajduk, PJDinges, JSchkeryantz, JMJanowick, DKaminski, MTufano, MAugeri, DJPetros, ANienaber, VZhong, PHammond, RCoen, MBeutel, BKatz, LFesik, SW Novel inhibitors of Erm methyltransferases from NMR and parallel synthesis. J Med Chem 42:3852-9 (1999)  
Target
Name:
rRNA adenine N-6-methyltransferase
Synonyms:
ERM_BACIU | Erythromycin resistance protein
Type:
PROTEIN
Mol. Mass.:
28925.75
Organism:
Bacillus subtilis
Description:
ChEMBL_67535
Residue:
244
  
Inhibitor
Name:
BDBM50081278
Synonyms:
CHEMBL333812 | {1-[4-Amino-6-(indan-2-ylamino)-[1,3,5]triazin-2-yl]-piperidin-4-yl}-methanol
Type:
Small organic molecule
Emp. Form.:
C18H24N6O
Mol. Mass.:
340.4228
SMILES:
Nc1nc(NC2Cc3ccccc3C2)nc(n1)N1CCC(CO)CC1
: