Target
Purine nucleoside phosphorylase
Ligand
BDBM50214705
Substrate
Meas. Tech.
ChEMBL_162186 (CHEMBL766706)
Ki
53±n/a nM
Citation
 Yokomatsu, THayakawa, YSuemune, KKihara, TSoeda, SShimeno, HShibuya, S Synthesis and biological evaluation of 1,1-difluoro-2-(tetrahydro-3-furanyl)ethylphosphonic acids possessing a N9-purinylmethyl functional group at the ring. a new class of inhibitors for purine nucleoside phosphorylases. Bioorg Med Chem Lett 9:2833-6 (1999)  
Target
Name:
Purine nucleoside phosphorylase
Synonyms:
Inosine phosphorylase NP PNPH_HUMAN | Purine nucleoside phosphorylase (PNPase)
Type:
Enzyme
Mol. Mass.:
32119.53
Organism:
Homo sapiens (Human)
Description:
Residue:
289
  
Inhibitor
Name:
BDBM50214705
Synonyms:
5-(2-amino-6-oxo-1,6-dihydro-9H-purin-9-yl)-1,1-difluoropentylphosphonate 9-(5,5-DIFLUORO-5-PHOSPHONOPENTYL)GUANINE [5-(2-Amino-6-oxo-1,6-dihydro-purin-9-yl)-1,1-difluoro-pentyl]-phosphonic acid
Type:
Small organic molecule
Emp. Form.:
C10H14F2N5O4P
Mol. Mass.:
337.2198
SMILES:
Nc1nc2n(CCCCC(F)(F)P(O)(O)=O)cnc2c(=O)[nH]1
: