Target
Collagenase 3
Ligand
BDBM50081866
Substrate
Meas. Tech.
ChEBML_101904
IC50
20±n/a nM
Citation
 Martin, FMBeckett, RPBellamy, CLCourtney, PFDavies, SJDrummond, AHDodd, RPratt, LMPatel, SRRicketts, MLTodd, RSTuffnell, ARWard, JWWhittaker, M The synthesis and biological evaluation of non-peptidic matrix metalloproteinase inhibitors. Bioorg Med Chem Lett 9:2887-92 (1999)  
Target
Name:
Collagenase 3
Synonyms:
MMP-13 MMP13_HUMAN Matrix metalloproteinase-13 (MMP-13) | Matrix metalloproteinase-13 (MMP13)
Type:
Enzyme
Mol. Mass.:
53808.06
Organism:
Homo sapiens (Human)
Description:
P45452
Residue:
471
  
Inhibitor
Name:
BDBM50081866
Synonyms:
(2R,3R)-3-(cyclopentylmethyl)-N-hydroxy-2-((4-methoxy-N-methylphenylsulfonamido)methyl)-4-morpholino-4-oxobutanamide CHEMBL329298
Type:
Small organic molecule
Emp. Form.:
C23H35N3O7S
Mol. Mass.:
497.605
SMILES:
COc1ccc(cc1)S(=O)(=O)N(C)C[C@@H]([C@@H](CC1CCCC1)C(=O)N1CCOCC1)C(=O)NO
: