Target
Dihydrofolate reductase
Ligand
BDBM50081914
Substrate
Meas. Tech.
ChEMBL_55095 (CHEMBL665356)
Ki
221±n/a nM
Citation
 Chowdhury, SFVillamor, VBGuerrero, RHLeal, IBrun, RCroft, SLGoodman, JMMaes, LRuiz-Perez, LMPacanowska, DGGilbert, IH Design, synthesis, and evaluation of inhibitors of trypanosomal and leishmanial dihydrofolate reductase. J Med Chem 42:4300-12 (1999)  
Target
Name:
Dihydrofolate reductase
Synonyms:
DHFR Dihydrofolate reductase (DHFR) | Tetrahydrofolate dehydrogenase
Type:
Enzyme
Mol. Mass.:
21453.99
Organism:
Homo sapiens (Human)
Description:
Recombinant human DHFR.
Residue:
187
  
Inhibitor
Name:
BDBM50081914
Synonyms:
5-(3-Heptyloxy-benzyl)-pyrimidine-2,4-diamine | CHEMBL285209
Type:
Small organic molecule
Emp. Form.:
C18H26N4O
Mol. Mass.:
314.4252
SMILES:
CCCCCCCOc1cccc(Cc2cnc(N)nc2N)c1
: