Target
Glutamate receptor ionotropic, NMDA 1/2B
Ligand
BDBM50082023
Substrate
Meas. Tech.
ChEMBL_141027 (CHEMBL748098)
IC50
200±n/a nM
Citation
 Kreimeyer, ALaube, BSturgess, MGoeldner, MFoucaud, B Evaluation and biological properties of reactive ligands for the mapping of the glycine site on the N-methyl-D-aspartate (NMDA) receptor. J Med Chem 42:4394-404 (1999)  
Target
Name:
Glutamate receptor ionotropic, NMDA 1/2B
Synonyms:
Glutamate NMDA receptor; Grin1/Grin2b | Glutamate [NMDA] receptor subunit epsilon 2/zeta 1
Type:
Mol. Mass.:
Description:
ASSAY_ID of EBI is 141026
Components:
This complex has 2 components.
Component 1
Name:
Glutamate receptor ionotropic, NMDA 2B
Synonyms:
GluN2B Grin2b NMDA receptor subunit N2B (GluN2B) NMDE2_RAT | NR2B
Type:
Protein
Mol. Mass.:
166077.66
Organism:
Rattus norvegicus (Rat)
Description:
Q00960
Residue:
1482
  
Component 2
Name:
Glutamate receptor ionotropic, NMDA 1
Synonyms:
Glutamate (NMDA) receptor subunit zeta 1 Glutamate-NMDA-Channel Glutamate-NMDA-Polyamine NMDA Nmdar1 | phencyclidine
Type:
Enzyme Catalytic Domain
Mol. Mass.:
105533.40
Organism:
RAT
Description:
P35439
Residue:
938
  
Inhibitor
Name:
BDBM50082023
Synonyms:
7-Chloro-4-hydroxy-3-(3-isothiocyanato-phenyl)-1H-quinolin-2-one | CHEMBL139009
Type:
Small organic molecule
Emp. Form.:
C16H9ClN2O2S
Mol. Mass.:
328.773
SMILES:
Oc1c(-c2cccc(c2)N=C=S)c(=O)[nH]c2cc(Cl)ccc12
: