Target
Glutamate receptor ionotropic, NMDA 1
Ligand
BDBM50082025
Substrate
Meas. Tech.
ChEMBL_140543 (CHEMBL748771)
Ki
64.3±n/a nM
Citation
 Kreimeyer, ALaube, BSturgess, MGoeldner, MFoucaud, B Evaluation and biological properties of reactive ligands for the mapping of the glycine site on the N-methyl-D-aspartate (NMDA) receptor. J Med Chem 42:4394-404 (1999)  
Target
Name:
Glutamate receptor ionotropic, NMDA 1
Synonyms:
Glutamate (NMDA) receptor subunit zeta 1 Glutamate-NMDA-Channel Glutamate-NMDA-Polyamine NMDA Nmdar1 | phencyclidine
Type:
Enzyme Catalytic Domain
Mol. Mass.:
105533.40
Organism:
RAT
Description:
P35439
Residue:
938
  
Inhibitor
Name:
BDBM50082025
Synonyms:
4-Hydroxy-7-isothiocyanato-3-(3-phenoxy-phenyl)-1H-quinolin-2-one | CHEMBL344145
Type:
Small organic molecule
Emp. Form.:
C22H14N2O3S
Mol. Mass.:
386.423
SMILES:
Oc1c(-c2cccc(Oc3ccccc3)c2)c(=O)[nH]c2cc(ccc12)N=C=S
: