Target
Glutamate receptor ionotropic, NMDA 1
Ligand
BDBM50082022
Substrate
Meas. Tech.
ChEMBL_140543 (CHEMBL748771)
Ki
24±n/a nM
Citation
 Kreimeyer, ALaube, BSturgess, MGoeldner, MFoucaud, B Evaluation and biological properties of reactive ligands for the mapping of the glycine site on the N-methyl-D-aspartate (NMDA) receptor. J Med Chem 42:4394-404 (1999)  
Target
Name:
Glutamate receptor ionotropic, NMDA 1
Synonyms:
Glutamate (NMDA) receptor subunit zeta 1 Glutamate-NMDA-Channel Glutamate-NMDA-Polyamine NMDA Nmdar1 | phencyclidine
Type:
Enzyme Catalytic Domain
Mol. Mass.:
105533.40
Organism:
RAT
Description:
P35439
Residue:
938
  
Inhibitor
Name:
BDBM50082022
Synonyms:
2-[3-(7-Chloro-4-hydroxy-2-oxo-1,2-dihydro-quinolin-3-yl)-phenylamino]-ethanesulfonyl fluoride | CHEMBL337346
Type:
Small organic molecule
Emp. Form.:
C17H14ClFN2O4S
Mol. Mass.:
396.82
SMILES:
Oc1c(-c2cccc(NCCS(F)(=O)=O)c2)c(=O)[nH]c2cc(Cl)ccc12
: