Target
Gamma-aminobutyric acid receptor subunit alpha-5
Ligand
BDBM50144858
Substrate
Meas. Tech.
ChEMBL_1901498 (CHEMBL4403720)
Ki
0.660000±n/a nM
Citation
 Maramai, SBenchekroun, MWard, SEAtack, JR Subtype Selective ?-Aminobutyric Acid Type A Receptor (GABA J Med Chem 63:3425-3446 (2020)  
Target
Name:
Gamma-aminobutyric acid receptor subunit alpha-5
Synonyms:
GABA receptor alpha-5 subunit GABRA5 Gamma-aminobutyric acid receptor subunit alpha-5 (GABA(A)) | Gamma-aminobutyric acid receptor subunit alpha-5 (GABAA)
Type:
Enzyme
Mol. Mass.:
52160.59
Organism:
Homo sapiens (Human)
Description:
P31644
Residue:
462
  
Inhibitor
Name:
BDBM50144858
Synonyms:
3-(5-Methyl-isoxazol-3-yl)-6-(1-methyl-1H-[1,2,3]triazol-4-ylmethoxy)-[1,2,4]triazolo[3,4-a]phthalazine | CHEMBL306422
Type:
Small organic molecule
Emp. Form.:
C17H14N8O2
Mol. Mass.:
362.3455
SMILES:
Cc1cc(no1)-c1nnc2c3ccccc3c(OCc3cn(C)nn3)nn12
: