Target
Sarcoplasmic/endoplasmic reticulum calcium ATPase 1
Ligand
BDBM176764
Substrate
Meas. Tech.
ChEMBL_1902006 (CHEMBL4404228)
IC50
2000±n/a nM
Citation
 Peterková, LKmoní?ková, ERuml, TRimpelová, S Sarco/Endoplasmic Reticulum Calcium ATPase Inhibitors: Beyond Anticancer Perspective. J Med Chem 63:1937-1963 (2020)  
Target
Name:
Sarcoplasmic/endoplasmic reticulum calcium ATPase 1
Synonyms:
AT2A1_RABIT Sarco/endoplasmic Reticulum Ca2+ ATPase 1 | Sarcoplasmic/endoplasmic reticulum calcium ATP-ase
Type:
PROTEIN
Mol. Mass.:
110435.34
Organism:
Oryctolagus cuniculus
Description:
ChEMBL_1500621
Residue:
1001
  
Inhibitor
Name:
BDBM176764
Synonyms:
2,5-Di-tert-butylhydroquinone US9688816, 7
Type:
Small organic molecule
Emp. Form.:
C14H22O2
Mol. Mass.:
222.3233
SMILES:
CC(C)(C)c1cc(O)c(cc1O)C(C)(C)C
: