Target
Urokinase-type plasminogen activator
Ligand
BDBM50060049
Substrate
Meas. Tech.
ChEMBL_155743 (CHEMBL760893)
Ki
38000±n/a nM
Citation
 Stürzebecher, JVieweg, HSteinmetzer, TSchweinitz, AStubbs, MTRenatus, MWikström, P 3-Amidinophenylalanine-based inhibitors of urokinase. Bioorg Med Chem Lett 9:3147-52 (1999)  
Target
Name:
Urokinase-type plasminogen activator
Synonyms:
3.4.21.73 U-plasminogen activator Urokinase Urokinase-type plasminogen activator chain B Urokinase-type plasminogen activator short chain A uPA
Type:
Enzyme
Mol. Mass.:
48528.62
Organism:
Homo sapiens (Human)
Description:
P00749
Residue:
431
  
Inhibitor
Name:
BDBM50060049
Synonyms:
3-[2-(Naphthalene-2-sulfonylamino)-3-oxo-3-piperidin-1-yl-propyl]-benzamidine | CHEMBL104241
Type:
Small organic molecule
Emp. Form.:
C25H28N4O3S
Mol. Mass.:
464.58
SMILES:
NC(=N)c1cccc(CC(NS(=O)(=O)c2ccc3ccccc3c2)C(=O)N2CCCCC2)c1
: