Target
Matrix metalloproteinase-9
Ligand
BDBM50082225
Substrate
Meas. Tech.
ChEBML_105820
IC50
190±n/a nM
Citation
 Bailey, SBolognese, BFaller, ALouis-Flamberg, PMacPherson, DTMayer, RJMarshall, LAMilner, PHMistry, JSmith, DGWard, JG Selective inhibition of low affinity IgE receptor (CD23) processing: P1' bicyclomethyl substituents. Bioorg Med Chem Lett 9:3165-70 (1999)  
Target
Name:
Matrix metalloproteinase-9
Synonyms:
67 kDa matrix metalloproteinase-9 92 kDa gelatinase CLG4B Gelatinase B MMP9 Matrix metalloproteinase 9 (MMP-9) Matrix metalloproteinase-9 (MMP9)
Type:
Enzyme
Mol. Mass.:
78452.28
Organism:
Homo sapiens (Human)
Description:
P14780
Residue:
707
  
Inhibitor
Name:
BDBM50082225
Synonyms:
(2R,3S)-N*4*-((S)-1-Carbamoyl-2,2-dimethyl-propyl)-2,N*1*-dihydroxy-3-quinolin-3-ylmethyl-succinamide | CHEMBL323228
Type:
Small organic molecule
Emp. Form.:
C20H26N4O5
Mol. Mass.:
402.4442
SMILES:
CC(C)(C)[C@H](NC(=O)[C@H](Cc1cnc2ccccc2c1)[C@H](O)C(=O)NO)C(N)=O
: