Target
Low affinity immunoglobulin epsilon Fc receptor
Ligand
BDBM50082218
Substrate
Meas. Tech.
ChEBML_88888
IC50
20±n/a nM
Citation
 Bailey, SBolognese, BFaller, ALouis-Flamberg, PMacPherson, DTMayer, RJMarshall, LAMilner, PHMistry, JSmith, DGWard, JG Selective inhibition of low affinity IgE receptor (CD23) processing: P1' bicyclomethyl substituents. Bioorg Med Chem Lett 9:3165-70 (1999)  
Target
Name:
Low affinity immunoglobulin epsilon Fc receptor
Synonyms:
BLAST-2 CD_antigen=CD23 FCE2 FCER2_HUMAN IGEBF Immunoglobulin epsilon Fc receptor Low affinity immunoglobulin epsilon Fc receptor membrane-bound form Lymphocyte IgE receptor
Type:
PROTEIN
Mol. Mass.:
36461.84
Organism:
Homo sapiens (Human)
Description:
ChEMBL_88888
Residue:
321
  
Inhibitor
Name:
BDBM50082218
Synonyms:
(2R,3S)-2-Benzo[b]thiophen-2-ylmethyl-N*1*-((S)-1-carbamoyl-2-phenyl-ethyl)-3,N*4*-dihydroxy-succinamide | CHEMBL322050
Type:
Small organic molecule
Emp. Form.:
C22H23N3O5S
Mol. Mass.:
441.5
SMILES:
NC(=O)[C@H](Cc1ccccc1)NC(=O)[C@H](Cc1cc2ccccc2s1)[C@H](O)C(=O)NO
: