Target
Stromelysin-1
Ligand
BDBM50082225
Substrate
Meas. Tech.
ChEBML_105818
IC50
3000±n/a nM
Citation
 Bailey, SBolognese, BFaller, ALouis-Flamberg, PMacPherson, DTMayer, RJMarshall, LAMilner, PHMistry, JSmith, DGWard, JG Selective inhibition of low affinity IgE receptor (CD23) processing: P1' bicyclomethyl substituents. Bioorg Med Chem Lett 9:3165-70 (1999)  
Target
Name:
Stromelysin-1
Synonyms:
MMP-3 MMP3_HUMAN Matrix metalloproteinase 3 Matrix metalloproteinase-3 (MMP-3) SL-1 Stromelysin 1 | Transin-1
Type:
Enzyme
Mol. Mass.:
53973.13
Organism:
Homo sapiens (Human)
Description:
P08254
Residue:
477
  
Inhibitor
Name:
BDBM50082225
Synonyms:
(2R,3S)-N*4*-((S)-1-Carbamoyl-2,2-dimethyl-propyl)-2,N*1*-dihydroxy-3-quinolin-3-ylmethyl-succinamide | CHEMBL323228
Type:
Small organic molecule
Emp. Form.:
C20H26N4O5
Mol. Mass.:
402.4442
SMILES:
CC(C)(C)[C@H](NC(=O)[C@H](Cc1cnc2ccccc2c1)[C@H](O)C(=O)NO)C(N)=O
: