Target
Neutral alpha-glucosidase C
Ligand
BDBM50082232
Substrate
Meas. Tech.
ChEBML_34410
IC50
46000±n/a nM
Citation
 Martin, ORCompain, PKizu, HAsano, N Revised structure of a homonojirimycin isomer from Aglaonema treubii: first example of a naturally occurring alpha-homoallonojirimycin. Bioorg Med Chem Lett 9:3171-4 (1999)  
Target
Name:
Neutral alpha-glucosidase C
Synonyms:
GANC_MOUSE | Ganc
Type:
PROTEIN
Mol. Mass.:
102002.29
Organism:
Mus musculus
Description:
ChEMBL_34410
Residue:
898
  
Inhibitor
Name:
BDBM50082232
Synonyms:
(3S,4S,5R)-2,6-Bis-hydroxymethyl-piperidine-3,4,5-triol | CHEMBL327137
Type:
Small organic molecule
Emp. Form.:
C7H15NO5
Mol. Mass.:
193.1977
SMILES:
OCC1NC(CO)[C@H](O)[C@H](O)[C@@H]1O
: