Target
JAK3/JAK1
Ligand
BDBM50193995
Substrate
Meas. Tech.
ChEMBL_1902606 (CHEMBL4404828)
IC50
6.7±n/a nM
Citation
 Leonard, KAMadge, LAKrawczuk, PJWang, AKreutter, KDBacani, GMChai, WSmith, RCTichenor, MSHarris, MCMalaviya, RSeierstad, MJohnson, MEVenable, JDKim, SHirst, GCMathur, ASRao, TSEdwards, JPRizzolio, MCKoudriakova, T Discovery of a Gut-Restricted JAK Inhibitor for the Treatment of Inflammatory Bowel Disease. J Med Chem 63:2915-2929 (2020)  
Target
Name:
JAK3/JAK1
Synonyms:
Tyrosine-protein kinase JAK1/JAK3
Type:
Mol. Mass.:
Description:
ASSAY_ID of ChEMBL is 2193386
Components:
This complex has 2 components.
Component 1
Name:
Tyrosine-protein kinase JAK3
Synonyms:
JAK-3 JAK3_HUMAN Janus kinase 3 (JAK3) L-JAK | Leukocyte janus kinase
Type:
Protein
Mol. Mass.:
125111.08
Organism:
Homo sapiens (Human)
Description:
P52333
Residue:
1124
  
Component 2
Name:
Tyrosine-protein kinase JAK1
Synonyms:
JAK-1 JAK1A JAK1_HUMAN Janus kinase 1 (JAK1) | Janus kinase 1 JAK1
Type:
Protein
Mol. Mass.:
133293.73
Organism:
Homo sapiens (Human)
Description:
P23458
Residue:
1154
  
Inhibitor
Name:
BDBM50193995
Synonyms:
3-((3R,4R)-4-methyl-3-(methyl(7H-pyrrolo[2,3-d]pyrimidin-4-yl)amino)piperidin-1-yl)-3-oxopropanenitrile 3-{(3R,4R)-4-methyl-3-[methyl(7H-pyrrolo[2,3-d]pyrimidin-4-yl)amino]piperidin-1-yl}-3-oxopropanenitrile CP-690550 Tofacitinib US10112907, Example 00035 US10766894, Compound TABLE 1.20 US11078206, Example Tofacitinib US11339167, Example Tofacitinib
Type:
Small organic molecule
Emp. Form.:
C16H20N6O
Mol. Mass.:
312.3696
SMILES:
C[C@@H]1CCN(C[C@@H]1N(C)c1ncnc2[nH]ccc12)C(=O)CC#N
: