Target
Nuclear receptor subfamily 1 group I member 2
Ligand
BDBM19993
Substrate
Meas. Tech.
ChEMBL_1902709 (CHEMBL4404931)
EC50
15±n/a nM
Citation
 Bartolini, DDe Franco, FTorquato, PMarinelli, RCerra, BRonchetti, RSchon, AFallarino, FDe Luca, ABellezza, GFerri, ISidoni, AWalton, WGPellock, SJRedinbo, MRMani, SPellicciari, RGioiello, AGalli, F Garcinoic Acid Is a Natural and Selective Agonist of Pregnane X Receptor. J Med Chem 63:3701-3712 (2020)  
Target
Name:
Nuclear receptor subfamily 1 group I member 2
Synonyms:
NR1I2 Orphan nuclear receptor PAR1 PXR SXR nuclear receptor subfamily 1 group I member 2 isoform 1
Type:
Nuclear receptor
Mol. Mass.:
49774.77
Organism:
Homo sapiens (Human)
Description:
O75469
Residue:
434
  
Inhibitor
Name:
BDBM19993
Synonyms:
CHEMBL62136 T 0901317 TO-901317 US10669296, Compound TO901317 [3H]T0901317
Type:
Small organic molecule
Emp. Form.:
C17H12F9NO3S
Mol. Mass.:
481.333
SMILES:
OC(c1ccc(cc1)N(CC(F)(F)F)S(=O)(=O)c1ccccc1)(C(F)(F)F)C(F)(F)F
: