Target
cAMP-specific 3',5'-cyclic phosphodiesterase 4D
Ligand
BDBM50527548
Substrate
Meas. Tech.
ChEMBL_1902812 (CHEMBL4405034)
Ki
0.851138±n/a nM
Citation
 Salado, IGSingh, AKMoreno-Cinos, CSakaine, GSiderius, MVan der Veken, PMatheeussen, Avan der Meer, TSadek, PGul, SMaes, LSterk, GJLeurs, RBrown, DAugustyns, K Lead Optimization of Phthalazinone Phosphodiesterase Inhibitors as Novel Antitrypanosomal Compounds. J Med Chem 63:3485-3507 (2020)  
Target
Name:
cAMP-specific 3',5'-cyclic phosphodiesterase 4D
Synonyms:
3',5'-cyclic phosphodiesterase PDE43 PDE4D_HUMAN | Phosphodiesterase 4D
Type:
Protein
Mol. Mass.:
91092.69
Organism:
Homo sapiens (Human)
Description:
Q08499
Residue:
809
  
Inhibitor
Name:
BDBM50527548
Synonyms:
CHEMBL4465097
Type:
Small organic molecule
Emp. Form.:
C31H38N4O6
Mol. Mass.:
562.6566
SMILES:
[H][C@@]12CC=CC[C@]1([H])C(=NN(C1CN(C1)C(=O)CN1C(=O)CC3(CCCCC3)CC1=O)C2=O)c1ccc(OC)c(OC)c1
: