Target
Muscarinic acetylcholine receptor M3
Ligand
BDBM50082333
Substrate
Meas. Tech.
ChEBML_138246
IC50
760±n/a nM
Citation
 Novelli, FSparatore, ATasso, BSparatore, F Quinolizidinyl derivatives of 5,11-dihydro-6H-pyrido[2,3-b][1,4]benzodiazepin-6-one as ligands for muscarinic receptors. Bioorg Med Chem Lett 9:3031-4 (1999)  
Target
Name:
Muscarinic acetylcholine receptor M3
Synonyms:
ACM3_RAT Chrm-3 | Chrm3
Type:
Enzyme Catalytic Domain
Mol. Mass.:
66086.66
Organism:
RAT
Description:
Cholinergic, muscarinic M3 CHRM3 RAT::P08483
Residue:
589
  
Inhibitor
Name:
BDBM50082333
Synonyms:
11-[2-(Octahydro-quinolizin-1-ylmethylsulfanyl)-acetyl]-5,11-dihydro-benzo[e]pyrido[3,2-b][1,4]diazepin-6-one | CHEMBL318316
Type:
Small organic molecule
Emp. Form.:
C24H28N4O2S
Mol. Mass.:
436.57
SMILES:
O=C(CSCC1CCCN2CCCCC12)N1c2ccccc2C(=O)Nc2cccnc12
: