Target
Muscarinic acetylcholine receptor M2
Ligand
BDBM50082334
Substrate
Meas. Tech.
ChEBML_140104
IC50
1000±n/a nM
Citation
 Novelli, FSparatore, ATasso, BSparatore, F Quinolizidinyl derivatives of 5,11-dihydro-6H-pyrido[2,3-b][1,4]benzodiazepin-6-one as ligands for muscarinic receptors. Bioorg Med Chem Lett 9:3031-4 (1999)  
Target
Name:
Muscarinic acetylcholine receptor M2
Synonyms:
ACM2_RAT Chrm-2 | Chrm2
Type:
Enzyme Catalytic Domain
Mol. Mass.:
51555.53
Organism:
RAT
Description:
P10980
Residue:
466
  
Inhibitor
Name:
BDBM50082334
Synonyms:
11-{2-[(Octahydro-quinolizin-1-ylmethyl)-amino]-acetyl}-5,11-dihydro-benzo[e]pyrido[3,2-b][1,4]diazepin-6-one | CHEMBL103785
Type:
Small organic molecule
Emp. Form.:
C24H29N5O2
Mol. Mass.:
419.5194
SMILES:
O=C(CNCC1CCCN2CCCCC12)N1c2ccccc2C(=O)Nc2cccnc12
: