Target
Adenosine receptor A2a
Ligand
BDBM50082426
Substrate
Meas. Tech.
ChEMBL_31378 (CHEMBL644670)
Ki
110±n/a nM
Citation
 Baraldi, PGCacciari, BRomagnoli, RSpalluto, GKlotz, KNLeung, EVarani, KGessi, SMerighi, SBorea, PA Pyrazolo[4,3-e]-1,2,4-triazolo[1,5-c]pyrimidine derivatives as highly potent and selective human A(3) adenosine receptor antagonists. J Med Chem 42:4473-8 (1999)  
Target
Name:
Adenosine receptor A2a
Synonyms:
A2A adenosine receptor (hA2A) ADENOSINE A2 ADORA2 Adenosine A2A receptor (A2AAR)
Type:
G Protein-Coupled Receptor (GPCR)
Mol. Mass.:
44716.46
Organism:
Homo sapiens (Human)
Description:
P29274
Residue:
412
  
Inhibitor
Name:
BDBM50082426
Synonyms:
1-(3-Chloro-phenyl)-3-(2-furan-2-yl-8-phenethyl-8H-pyrazolo[4,3-e][1,2,4]triazolo[1,5-c]pyrimidin-5-yl)-urea CHEMBL137950
Type:
Small organic molecule
Emp. Form.:
C25H19ClN8O2
Mol. Mass.:
498.924
SMILES:
Clc1cccc(NC(=O)Nc2nc3nn(CCc4ccccc4)cc3c3nc(nn23)-c2ccco2)c1
: