Target
Inositol 1,4,5-trisphosphate receptor type 1
Ligand
BDBM50527900
Substrate
Meas. Tech.
ChEMBL_1903898 (CHEMBL4406120)
Kd
0.000±n/a nM
Comments
0.000000 20220115
Citation
 Shipton, MLRiley, AMRossi, AMBrearley, CATaylor, CWPotter, BVL Both d- and l-Glucose Polyphosphates Mimic d- J Med Chem 63:5442-5457 (2020)  
Target
Name:
Inositol 1,4,5-trisphosphate receptor type 1
Synonyms:
ITPR1_RAT Itpr1
Type:
PROTEIN
Mol. Mass.:
313234.63
Organism:
Rattus norvegicus
Description:
ChEMBL_818416
Residue:
2750
  
Inhibitor
Name:
BDBM50527900
Synonyms:
CHEMBL4445052
Type:
Small organic molecule
Emp. Form.:
C25H62N3O15P3
Mol. Mass.:
737.6922
SMILES:
CCN(CC)CC.CCN(CC)CC.CCN(CC)CC.CO[C@H]1O[C@H](COP(O)(O)=O)[C@@H](O)[C@H](OP(O)(O)=O)[C@H]1OP(O)(O)=O
: