Target
Stromelysin-1
Ligand
BDBM50082500
Substrate
Meas. Tech.
ChEMBL_104726 (CHEMBL710727)
IC50
10000±n/a nM
Citation
 Matter, HSchwab, W Affinity and selectivity of matrix metalloproteinase inhibitors: a chemometrical study from the perspective of ligands and proteins. J Med Chem 42:4506-23 (1999)  
Target
Name:
Stromelysin-1
Synonyms:
MMP-3 MMP3_HUMAN Matrix metalloproteinase 3 Matrix metalloproteinase-3 (MMP-3) SL-1 Stromelysin 1 | Transin-1
Type:
Enzyme
Mol. Mass.:
53973.13
Organism:
Homo sapiens (Human)
Description:
P08254
Residue:
477
  
Inhibitor
Name:
BDBM50082500
Synonyms:
CHEMBL137966 | [7-((S)-2-Amino-propionylamino)-2-(4-methoxy-benzenesulfonyl)-1,2,3,4-tetrahydro-isoquinolin-3-yl]-oxo-acetic acid
Type:
Small organic molecule
Emp. Form.:
C21H23N3O7S
Mol. Mass.:
461.488
SMILES:
COc1ccc(cc1)S(=O)(=O)N1Cc2cc(NC(=O)[C@H](C)N)ccc2CC1C(=O)C(O)=O
: