Target
Neuropeptide Y receptor type 4
Ligand
BDBM50528180
Substrate
Meas. Tech.
ChEMBL_1904522 (CHEMBL4406744)
EC50
4.3±n/a nM
Citation
 Richardson, RRGroenen, MLiu, MMountford, SJBriddon, SJHolliday, NDThompson, PE Heterodimeric Analogues of the Potent Y1R Antagonist 1229U91, Lacking One of the Pharmacophoric C-Terminal Structures, Retain Potent Y1R Affinity and Show Improved Selectivity over Y4R. J Med Chem 63:5274-5286 (2020)  
Target
Name:
Neuropeptide Y receptor type 4
Synonyms:
NPY-Y4 NPY4R PP1 Pancreatic polypeptide receptor 1
Type:
Enzyme Catalytic Domain
Mol. Mass.:
42207.58
Organism:
Homo sapiens (Human)
Description:
NPY-Y4 PPYR1 HUMAN::P50391
Residue:
375
  
Inhibitor
Name:
BDBM50528180
Synonyms:
CHEMBL4578617
Type:
Small organic molecule
Emp. Form.:
C114H178N34O24
Mol. Mass.:
2408.8465
SMILES:
CC[C@H](C)[C@H](N)C(=O)N[C@H]1CCC(=O)NCCC[C@H](NC(=O)[C@@H]2CCCN2C(=O)[C@H](CCC(=O)NCCC[C@H](NC(=O)[C@@H]2CCCN2C1=O)C(=O)N[C@@H](Cc1ccc(O)cc1)C(=O)N[C@@H](CCCNC(N)=N)C(=O)N[C@@H](CC(C)C)C(=O)N[C@@H](CCCNC(N)=N)C(=O)N[C@@H](Cc1ccc(O)cc1)C(N)=O)NC(=O)[C@@H](N)[C@@H](C)CC)C(=O)N[C@@H](Cc1ccc(O)cc1)C(=O)N[C@@H](CCCNC(N)=N)C(=O)N[C@@H](CC(C)C)C(=O)N[C@@H](CCCNC(N)=N)C(=O)N[C@@H](Cc1ccc(O)cc1)C(N)=O
: