Target
Disintegrin and metalloproteinase domain-containing protein 17
Ligand
BDBM50082949
Substrate
Meas. Tech.
ChEMBL_212750 (CHEMBL820592)
IC50
0.6±n/a nM
Citation
 Barlaam, BBird, TGLambert-Van Der Brempt, CCampbell, DFoster, SJMaciewicz, R New alpha-substituted succinate-based hydroxamic acids as TNFalpha convertase inhibitors. J Med Chem 42:4890-908 (1999)  
Target
Name:
Disintegrin and metalloproteinase domain-containing protein 17
Synonyms:
ADA17_HUMAN CSVP Disintegrin and metalloproteinase domain-containing protein 17 (ADAM17) TNF-alpha convertase TNF-alpha-converting enzyme (TACE) Tumor necrosis factor-α converting enzyme (TACE)
Type:
Enzyme
Mol. Mass.:
93007.89
Organism:
Homo sapiens (Human)
Description:
Residue:
824
  
Inhibitor
Name:
BDBM50082949
Synonyms:
(2R,3S)-N*1*-((S)-2,2-Dimethyl-1-methylcarbamoyl-propyl)-N*4*-hydroxy-2-isobutyl-3-(naphthalen-2-ylmethoxy)-succinamide | CHEMBL344312
Type:
Small organic molecule
Emp. Form.:
C26H37N3O5
Mol. Mass.:
471.5891
SMILES:
CNC(=O)[C@@H](NC(=O)[C@H](CC(C)C)[C@H](OCc1ccc2ccccc2c1)C(=O)NO)C(C)(C)C
: