Target
Prostaglandin G/H synthase 2
Ligand
BDBM50241867
Substrate
Meas. Tech.
ChEMBL_1904852 (CHEMBL4407210)
IC50
11300±n/a nM
Citation
 Kishore, NKumar, PShanker, KVerma, AK Human disorders associated with inflammation and the evolving role of natural products to overcome. Eur J Med Chem 179:272-309 (2019)  
Target
Name:
Prostaglandin G/H synthase 2
Synonyms:
COX2 Cyclooxygenase-2 (COX-2) PTGS2 Prostaglandin G/H synthase (cyclooxygenase)
Type:
Protein
Mol. Mass.:
68976.98
Organism:
Ovis aries (Sheep)
Description:
Residue:
603
  
Inhibitor
Name:
BDBM50241867
Synonyms:
((2R,3R,4R,5R,6R)-6-(3,4-dihydroxyphenethoxy)-5-hydroxy-2-(hydroxymethyl)-4-((2S,3R,4R,5R,6S)-3,4,5-trihydroxy-6-methyltetrahydro-2H-pyran-2-yloxy)tetrahydro-2H-pyran-3-yl) 3-(3,4-dihydroxyphenyl)acrylate ACETOSIDE cid_24978601 verbacoside | verbascoside
Type:
Small organic molecule
Emp. Form.:
C29H36O15
Mol. Mass.:
624.5871
SMILES:
C[C@@H]1O[C@@H](O[C@@H]2[C@@H](O)[C@H](OCCc3ccc(O)c(O)c3)O[C@H](CO)[C@H]2OC(=O)\C=C\c2ccc(O)c(O)c2)[C@H](O)[C@H](O)[C@H]1O
: