Target
Adenosine receptor A1
Ligand
BDBM50528492
Substrate
Meas. Tech.
ChEMBL_1905168 (CHEMBL4407526)
Ki
0.980000±n/a nM
Citation
 Betti, MCatarzi, DVarano, FFalsini, MVarani, KVincenzi, FPasquini, Sdi Cesare Mannelli, LGhelardini, CLucarini, EDal Ben, DSpinaci, ABartolucci, GMenicatti, MColotta, V Modifications on the Amino-3,5-dicyanopyridine Core To Obtain Multifaceted Adenosine Receptor Ligands with Antineuropathic Activity. J Med Chem 62:6894-6912 (2019)  
Target
Name:
Adenosine receptor A1
Synonyms:
A1 adenosine receptor (hA1) AA1R_HUMAN ADORA1 Adenosine A1-receptor Adenosine receptor A1 (hA1) | Adenosine transporter (AdT)
Type:
G Protein-Coupled Receptor (GPCR)
Mol. Mass.:
36520.92
Organism:
Homo sapiens (Human)
Description:
P30542
Residue:
326
  
Inhibitor
Name:
BDBM50528492
Synonyms:
CHEMBL4557250
Type:
Small organic molecule
Emp. Form.:
C19H14N4O2S
Mol. Mass.:
362.405
SMILES:
Nc1nc(SCc2cccc(CO)c2)c(C#N)c(-c2ccco2)c1C#N
: