Target
Similar to alpha-tubulin isoform 1
Ligand
BDBM50528633
Substrate
Meas. Tech.
ChEMBL_1905929 (CHEMBL4408287)
IC50
420±n/a nM
Citation
 Romagnoli, ROliva, PSalvador, MKCamacho, MEPadroni, CBrancale, AFerla, SHamel, ERonca, RGrillo, EBortolozzi, RRruga, FMariotto, EViola, G Design, synthesis and biological evaluation of novel vicinal diaryl-substituted 1H-Pyrazole analogues of combretastatin A-4 as highly potent tubulin polymerization inhibitors. Eur J Med Chem 181:0 (2019)  
Target
Name:
Similar to alpha-tubulin isoform 1
Synonyms:
Similar to alpha-tubulin isoform 1
Type:
PROTEIN
Mol. Mass.:
10383.05
Organism:
Bos taurus
Description:
ChEMBL_104716
Residue:
99
  
Inhibitor
Name:
BDBM50528633
Synonyms:
CHEMBL4522990
Type:
Small organic molecule
Emp. Form.:
C19H19FN2O4
Mol. Mass.:
358.3636
SMILES:
COc1ccc(cc1F)-c1c[nH]nc1-c1cc(OC)c(OC)c(OC)c1
: