Target
Protein farnesyltransferase subunit beta/geranylgeranyltransferase type-1 subunit alpha
Ligand
BDBM50083589
Substrate
Meas. Tech.
ChEMBL_70275 (CHEMBL681414)
IC50
0.400000±n/a nM
Citation
 Dinsmore, CJWilliams, TMO'Neill, TJLiu, DRands, ECulberson, JCLobell, RBKoblan, KSKohl, NEGibbs, JBOliff, AIGraham, SLHartman, GD Imidazole-containing diarylether and diarylsulfone inhibitors of farnesyl-protein transferase. Bioorg Med Chem Lett 9:3301-6 (2000)  
Target
Name:
Protein farnesyltransferase subunit beta/geranylgeranyltransferase type-1 subunit alpha
Synonyms:
Protein Farnesyltransferase (PFT) | Protein farnesyltransferase
Type:
Protein Complex
Mol. Mass.:
Description:
Purified bovine brain FTase.
Components:
This complex has 2 components.
Component 1
Name:
Protein farnesyltransferase/geranylgeranyltransferase type-1 subunit alpha
Synonyms:
CAAX farnesyltransferase alpha subunit FNTA_BOVIN GGTase-I-alpha Protein Farnesyltransferase (PFT) Chain A Protein farnesyltransferase/geranylgeranyltransferase type I alpha subunit Type I protein geranyl-geranyltransferase alpha subunit
Type:
Enzyme
Mol. Mass.:
43827.38
Organism:
Bos taurus (bovine)
Description:
The enzyme was purified from a bovine brain homogenate by sequential ammonium sulfate fractionation and affinity chromatography.
Residue:
375
  
Component 2
Name:
Protein farnesyltransferase subunit beta
Synonyms:
CAAX farnesyltransferase subunit beta FNTB_BOVIN Protein farnesyltransferase Protein farnesyltransferase subunit beta Ras proteins prenyltransferase subunit beta
Type:
Enzyme Subunit
Mol. Mass.:
48758.49
Organism:
Bos taurus (bovine)
Description:
Protein farnesyltransferase subunit beta
Residue:
437
  
Inhibitor
Name:
BDBM50083589
Synonyms:
3-[4-((S)-2-Amino-3-mercapto-propylamino)-phenoxy]-benzoic acid | CHEMBL113226
Type:
Small organic molecule
Emp. Form.:
C16H18N2O3S
Mol. Mass.:
318.391
SMILES:
N[C@H](CS)CNc1ccc(Oc2cccc(c2)C(O)=O)cc1
: