Target
Cyclin-dependent kinase 9
Ligand
BDBM50528817
Substrate
Meas. Tech.
ChEMBL_1906403 (CHEMBL4408761)
IC50
<4.0±n/a nM
Citation
 Sánchez-Martínez, CLallena, MJSanfeliciano, SGde Dios, A Cyclin dependent kinase (CDK) inhibitors as anticancer drugs: Recent advances (2015-2019). Bioorg Med Chem Lett 29:0 (2019)  
Target
Name:
Cyclin-dependent kinase 9
Synonyms:
C-2K CDK9 Cell division cycle 2-like protein kinase 4 Cyclin-Dependent Kinase 9 (CDK9) Serine/threonine-protein kinase PITALRE Tat-associated kinase complex catalytic subunit
Type:
Enzyme Subunit
Mol. Mass.:
42789.13
Organism:
Homo sapiens (Human)
Description:
Residue:
372
  
Inhibitor
Name:
BDBM50528817
Synonyms:
CHEMBL4462530 US20230416221, Compound AZD4573
Type:
Small organic molecule
Emp. Form.:
C22H28ClN5O2
Mol. Mass.:
429.943
SMILES:
CC(=O)N[C@@H]1CCC[C@@H](C1)C(=O)Nc1cc(-c2cnn3CC(C)(C)Cc23)c(Cl)cn1
: