Target
CDK-activating kinase assembly factor MAT1/Cyclin-H/Cyclin-dependent kinase 7
Ligand
BDBM50110178
Substrate
Meas. Tech.
ChEMBL_1906444 (CHEMBL4408802)
Ki
255±n/a nM
Citation
 Sánchez-Martínez, CLallena, MJSanfeliciano, SGde Dios, A Cyclin dependent kinase (CDK) inhibitors as anticancer drugs: Recent advances (2015-2019). Bioorg Med Chem Lett 29:0 (2019)  
Target
Name:
CDK-activating kinase assembly factor MAT1/Cyclin-H/Cyclin-dependent kinase 7
Synonyms:
CDK-activating kinase assembly factor MAT1/Cyclin H/Cyclin-dependent kinase 7 | CDK7/Cyclin H/MNAT1
Type:
Protein
Mol. Mass.:
Description:
Components:
This complex has 3 components.
Component 1
Name:
Cyclin-dependent kinase 7
Synonyms:
39 kDa protein kinase CAK1 CDK-activating kinase 1 (CAK) CDK7_HUMAN Cell division protein kinase 7 Cyclin-dependent kinase 7 (CDK7/cyclin H) P39 Mo15 TFIIH basal transcription factor complex kinase subunit
Type:
Enzyme Subunit
Mol. Mass.:
39047.01
Organism:
Homo sapiens (Human)
Description:
Residue:
346
  
Component 2
Name:
Cyclin-H
Synonyms:
CCNH Cyclin H p34 | p37
Type:
Enzyme Subunit
Mol. Mass.:
37646.05
Organism:
Homo sapiens (Human)
Description:
Residue:
323
  
Component 3
Name:
CDK-activating kinase assembly factor MAT1
Synonyms:
CAP35 Cyclin-G1-interacting protein MAT1_HUMAN Menage a trois RING finger protein MAT1 p35 | p36
Type:
Enzyme
Mol. Mass.:
35820.03
Organism:
Homo sapiens (Human)
Description:
P51948
Residue:
309
  
Inhibitor
Name:
BDBM50110178
Synonyms:
CHEMBL3603847 | US10787436, Compound I-23
Type:
Small organic molecule
Emp. Form.:
C31H28ClN7O2
Mol. Mass.:
566.053
SMILES:
CN(C)C\C=C\C(=O)Nc1ccc(cc1)C(=O)Nc1cccc(Nc2ncc(Cl)c(n2)-c2c[nH]c3ccccc23)c1
: