Target
Cyclin-dependent kinase 12
Ligand
BDBM50528812
Substrate
Meas. Tech.
ChEMBL_1906436 (CHEMBL4408794)
IC50
20±n/a nM
Citation
 Sánchez-Martínez, CLallena, MJSanfeliciano, SGde Dios, A Cyclin dependent kinase (CDK) inhibitors as anticancer drugs: Recent advances (2015-2019). Bioorg Med Chem Lett 29:0 (2019)  
Target
Name:
Cyclin-dependent kinase 12
Synonyms:
2.7.11.22 CDC2-related protein kinase 7 CDK12_HUMAN CRKRS Cell division cycle 2-related protein kinase 7 Cyclin-dependent kinase 12 hCDK12
Type:
PROTEIN
Mol. Mass.:
164218.64
Organism:
Homo sapiens
Description:
ChEMBL_117739
Residue:
1490
  
Inhibitor
Name:
BDBM50528812
Synonyms:
CHEMBL4582951
Type:
Small organic molecule
Emp. Form.:
C31H35ClN8O2
Mol. Mass.:
587.115
SMILES:
CN(C)C\C=C\C(=O)Nc1ccc(nc1)C(=O)N[C@@]1(C)CCC[C@H](C1)Nc1ncc(Cl)c(n1)-c1c[nH]c2ccccc12
: