Target
Kappa-type opioid receptor
Ligand
BDBM50491417
Substrate
Meas. Tech.
ChEMBL_1906943 (CHEMBL4409301)
Kd
0.590000±n/a nM
Citation
 Turnaturi, RChiechio, SSalerno, LRescifina, APittalą, VCantarella, GTomarchio, EParenti, CPasquinucci, L Progress in the development of more effective and safer analgesics for pain management. Eur J Med Chem 183:0 (2019)  
Target
Name:
Kappa-type opioid receptor
Synonyms:
K-OR-1 Kappa-opioid receptor (KOR) Kappa-type opioid receptor (KOR) OPIATE Kappa OPRK1 kappa opioid receptor (KOR)
Type:
G Protein-Coupled Receptor (GPCR)
Mol. Mass.:
42648.76
Organism:
Homo sapiens (Human)
Description:
P41145
Residue:
380
  
Inhibitor
Name:
BDBM50491417
Synonyms:
22-THIOCYANATOSALVINORIN A
Type:
Small organic molecule
Emp. Form.:
C24H27NO8S
Mol. Mass.:
489.538
SMILES:
[H][C@@]12CC[C@@]3(C)[C@@H](C[C@H](OC(=O)CSC#N)C(=O)[C@]3([H])[C@@]1(C)C[C@H](OC2=O)c1ccoc1)C(=O)OC
: