Target
Kappa-type opioid receptor
Ligand
BDBM50474153
Substrate
Meas. Tech.
ChEMBL_1906984 (CHEMBL4409342)
EC50
53±n/a nM
Citation
 Turnaturi, RChiechio, SSalerno, LRescifina, APittalą, VCantarella, GTomarchio, EParenti, CPasquinucci, L Progress in the development of more effective and safer analgesics for pain management. Eur J Med Chem 183:0 (2019)  
Target
Name:
Kappa-type opioid receptor
Synonyms:
Kappa Opioid Receptor OPRK1 Opiate Kappa 1 | mu/kappa opioid receptor
Type:
G Protein-Coupled Receptor (GPCR)
Mol. Mass.:
42744.99
Organism:
Cavia porcellus (domestic guinea pig)
Description:
P41144
Residue:
380
  
Inhibitor
Name:
BDBM50474153
Synonyms:
CHEMBL61630
Type:
Small organic molecule
Emp. Form.:
C23H30N2O5
Mol. Mass.:
414.4947
SMILES:
[H][C@@]12C[C@@H]([C@H](CC)CN1CC[C@@]1(O)C2=Nc2cccc(OC)c12)C(=C/OC)\C(=O)OC
: