Target
Kappa-type opioid receptor
Ligand
BDBM50474152
Substrate
Meas. Tech.
ChEMBL_1906984 (CHEMBL4409342)
EC50
230±n/a nM
Citation
 Turnaturi, RChiechio, SSalerno, LRescifina, APittalą, VCantarella, GTomarchio, EParenti, CPasquinucci, L Progress in the development of more effective and safer analgesics for pain management. Eur J Med Chem 183:0 (2019)  
Target
Name:
Kappa-type opioid receptor
Synonyms:
Kappa Opioid Receptor OPRK1 Opiate Kappa 1 | mu/kappa opioid receptor
Type:
G Protein-Coupled Receptor (GPCR)
Mol. Mass.:
42744.99
Organism:
Cavia porcellus (domestic guinea pig)
Description:
P41144
Residue:
380
  
Inhibitor
Name:
BDBM50474152
Synonyms:
CHEBI:6956 | CHEMBL299031
Type:
Small organic molecule
Emp. Form.:
C23H30N2O4
Mol. Mass.:
398.4953
SMILES:
[H][C@@]1(CC)CN2CCc3c([nH]c4cccc(OC)c34)[C@]2([H])C[C@]1([H])C(=C/OC)\C(=O)OC
: