Target
Prothrombin
Ligand
BDBM50083965
Substrate
Meas. Tech.
ChEBML_208342
Ki
>1000±n/a nM
Citation
 Soll, RMLu, TTomczuk, BIllig, CRFedde, CEisennagel, SBone, RMurphy, LSpurlino, JSalemme, FR Amidinohydrazones as guanidine bioisosteres: application to a new class of potent, selective and orally bioavailable, non-amide-based small-molecule thrombin inhibitors. Bioorg Med Chem Lett 10:1-4 (2000)  
Target
Name:
Prothrombin
Synonyms:
Activation peptide fragment 1 Coagulation factor II Prothrombin precursor Thrombin heavy chain | Thrombin light chain
Type:
Protein
Mol. Mass.:
70029.57
Organism:
Homo sapiens (Human)
Description:
P00734
Residue:
622
  
Inhibitor
Name:
BDBM50083965
Synonyms:
3-[((2E)-2-{[(E)-amino(imino)methyl]hydrazono}ethyl)oxy]-5-methylphenyl 2-methoxybenzenesulfonate | CHEMBL128016
Type:
Small organic molecule
Emp. Form.:
C17H20N4O5S
Mol. Mass.:
392.429
SMILES:
COc1ccccc1S(=O)(=O)Oc1cc(C)cc(OCC=NNC(N)=N)c1
: