Target
Prothrombin
Ligand
BDBM50084183
Substrate
Meas. Tech.
ChEMBL_208360 (CHEMBL813670)
Ki
630±n/a nM
Citation
 Guilford, WJShaw, KJDallas, JLKoovakkat, SLee, WLiang, ALight, DRMcCarrick, MAWhitlow, MYe, BMorrissey, MM Synthesis, characterization, and structure-activity relationships of amidine-substituted (bis)benzylidene-cycloketone olefin isomers as potent and selective factor Xa inhibitors. J Med Chem 42:5415-25 (2000)  
Target
Name:
Prothrombin
Synonyms:
Activation peptide fragment 1 Coagulation factor II Prothrombin precursor Thrombin heavy chain | Thrombin light chain
Type:
Protein
Mol. Mass.:
70029.57
Organism:
Homo sapiens (Human)
Description:
P00734
Residue:
622
  
Inhibitor
Name:
BDBM50084183
Synonyms:
3-[1-(4-Carbamimidoyl-phenyl)-meth-(E)-ylidene]-5-[1-(4-carbamimidoyl-phenyl)-meth-(Z)-ylidene]-4-oxo-piperidine-1-carboxylic acid ethyl ester | CHEMBL151661
Type:
Small organic molecule
Emp. Form.:
C24H25N5O3
Mol. Mass.:
431.487
SMILES:
CCOC(=O)N1C\C(=C\c2ccc(cc2)C(N)=N)C(=O)\C(C1)=C\c1ccc(cc1)C(N)=N
: