Target
Phosphatidylinositol 4,5-bisphosphate 3-kinase catalytic subunit delta isoform
Ligand
BDBM384664
Substrate
Meas. Tech.
ChEMBL_1908539 (CHEMBL4410897)
IC50
1.9±n/a nM
Citation
 Yue, EWLi, YLDouty, BHe, CMei, SWayland, BMaduskuie, TFalahatpisheh, NSparks, RBPolam, PZhu, WGlenn, JFeng, HZhang, KLi, YHe, XKatiyar, KCovington, MFeldman, PShin, NWang, KHDiamond, SLi, YKoblish, HKHall, LScherle, PYeleswaram, SXue, CBMetcalf, BCombs, APYao, W INCB050465 (Parsaclisib), a Novel Next-Generation Inhibitor of Phosphoinositide 3-Kinase Delta (PI3K?). ACS Med Chem Lett 10:1554-1560 (2019)  
Target
Name:
Phosphatidylinositol 4,5-bisphosphate 3-kinase catalytic subunit delta isoform
Synonyms:
PI3-kinase p110 subunit delta PI3-kinase subunit p110-delta PIK3CD Phosphatidylinositol 4,5-biphosphate 3-kinase catalytic subunit delta (PIK3CD) Phosphatidylinositol 4,5-bisphosphate 3-kinase 110 kDa catalytic subunit delta (PI3K delta) Phosphatidylinositol 4,5-bisphosphate 3-kinase catalytic subunit delta (PI3Kdelta) Phosphatidylinositol 4,5-bisphosphate 3-kinase catalytic subunit delta isoform (PI3K delta) Phosphatidylinositol 4,5-bisphosphate 3-kinase catalytic subunit delta isoform (PI3K-delta) Phosphatidylinositol 4,5-bisphosphate 3-kinase catalytic subunit delta isoform (PI3Kdelta)
Type:
Enzyme Subunit
Mol. Mass.:
119489.41
Organism:
Homo sapiens (Human)
Description:
O00329
Residue:
1044
  
Inhibitor
Name:
BDBM384664
Synonyms:
4-((5)-1-(4-amino-3-methyl-1H-pyrazolo[3,4-d]pyrimidin-1-yl)ethyl)-6-chloro-2-(14 (R)-2-hydroxypropyl)azetidin-3-yl)-3-methoxybenzonitrile | US9932341, Example 362
Type:
Small organic molecule
Emp. Form.:
C22H26ClN7O2
Mol. Mass.:
455.941
SMILES:
COc1c(cc(Cl)c(C#N)c1C1CN(C[C@H](C)O)C1)[C@H](C)n1nc(C)c2c(N)ncnc12
: