Target
Phosphatidylinositol 4,5-bisphosphate 3-kinase catalytic subunit delta isoform
Ligand
BDBM261317
Substrate
Meas. Tech.
ChEMBL_1908539 (CHEMBL4410897)
IC50
1.4±n/a nM
Citation
 Yue, EWLi, YLDouty, BHe, CMei, SWayland, BMaduskuie, TFalahatpisheh, NSparks, RBPolam, PZhu, WGlenn, JFeng, HZhang, KLi, YHe, XKatiyar, KCovington, MFeldman, PShin, NWang, KHDiamond, SLi, YKoblish, HKHall, LScherle, PYeleswaram, SXue, CBMetcalf, BCombs, APYao, W INCB050465 (Parsaclisib), a Novel Next-Generation Inhibitor of Phosphoinositide 3-Kinase Delta (PI3K?). ACS Med Chem Lett 10:1554-1560 (2019)  
Target
Name:
Phosphatidylinositol 4,5-bisphosphate 3-kinase catalytic subunit delta isoform
Synonyms:
PI3-kinase p110 subunit delta PI3-kinase subunit p110-delta PIK3CD Phosphatidylinositol 4,5-biphosphate 3-kinase catalytic subunit delta (PIK3CD) Phosphatidylinositol 4,5-bisphosphate 3-kinase 110 kDa catalytic subunit delta (PI3K delta) Phosphatidylinositol 4,5-bisphosphate 3-kinase catalytic subunit delta (PI3Kdelta) Phosphatidylinositol 4,5-bisphosphate 3-kinase catalytic subunit delta isoform (PI3K delta) Phosphatidylinositol 4,5-bisphosphate 3-kinase catalytic subunit delta isoform (PI3K-delta) Phosphatidylinositol 4,5-bisphosphate 3-kinase catalytic subunit delta isoform (PI3Kdelta)
Type:
Enzyme Subunit
Mol. Mass.:
119489.41
Organism:
Homo sapiens (Human)
Description:
O00329
Residue:
1044
  
Inhibitor
Name:
BDBM261317
Synonyms:
US10376513, Example 310 US9707233, 311
Type:
Small organic molecule
Emp. Form.:
C21H25ClN6O2
Mol. Mass.:
428.915
SMILES:
CCOc1c(cc(Cl)c(C)c1C1CNC(=O)C1)[C@H](C)n1nc(C)c2c(N)ncnc12
: