Target
Phosphatidylinositol 4,5-bisphosphate 3-kinase catalytic subunit delta isoform
Ligand
BDBM50529390
Substrate
Meas. Tech.
ChEMBL_1908539 (CHEMBL4410897)
IC50
3.6±n/a nM
Citation
 Yue, EWLi, YLDouty, BHe, CMei, SWayland, BMaduskuie, TFalahatpisheh, NSparks, RBPolam, PZhu, WGlenn, JFeng, HZhang, KLi, YHe, XKatiyar, KCovington, MFeldman, PShin, NWang, KHDiamond, SLi, YKoblish, HKHall, LScherle, PYeleswaram, SXue, CBMetcalf, BCombs, APYao, W INCB050465 (Parsaclisib), a Novel Next-Generation Inhibitor of Phosphoinositide 3-Kinase Delta (PI3K?). ACS Med Chem Lett 10:1554-1560 (2019)  
Target
Name:
Phosphatidylinositol 4,5-bisphosphate 3-kinase catalytic subunit delta isoform
Synonyms:
PI3-kinase p110 subunit delta PI3-kinase subunit p110-delta PIK3CD Phosphatidylinositol 4,5-biphosphate 3-kinase catalytic subunit delta (PIK3CD) Phosphatidylinositol 4,5-bisphosphate 3-kinase 110 kDa catalytic subunit delta (PI3K delta) Phosphatidylinositol 4,5-bisphosphate 3-kinase catalytic subunit delta (PI3Kdelta) Phosphatidylinositol 4,5-bisphosphate 3-kinase catalytic subunit delta isoform (PI3K delta) Phosphatidylinositol 4,5-bisphosphate 3-kinase catalytic subunit delta isoform (PI3K-delta) Phosphatidylinositol 4,5-bisphosphate 3-kinase catalytic subunit delta isoform (PI3Kdelta)
Type:
Enzyme Subunit
Mol. Mass.:
119489.41
Organism:
Homo sapiens (Human)
Description:
O00329
Residue:
1044
  
Inhibitor
Name:
BDBM50529390
Synonyms:
CHEMBL4470672
Type:
Small organic molecule
Emp. Form.:
C22H22ClN5O3S
Mol. Mass.:
471.96
SMILES:
COc1c(cc(Cl)c(C)c1-c1ccc(cc1)S(C)(=O)=O)[C@H](C)Nc1ncnc2[nH]cnc12
: