Target
Mu-type opioid receptor
Ligand
BDBM50085059
Substrate
Meas. Tech.
ChEMBL_148682 (CHEMBL751056)
IC50
173±n/a nM
Citation
 Bonner, GGDavis, PStropova, DEdsall, SYamamura, HIPorreca, FHruby, VJ Opiate aromatic pharmacophore structure-activity relationships in CTAP analogues determined by topographical bias, two-dimensional NMR, and biological activity assays. J Med Chem 43:569-80 (2000)  
Target
Name:
Mu-type opioid receptor
Synonyms:
MOR-1 Mu-type opioid receptor (MOR) OPRM_RAT Opioid receptor B Ror-b
Type:
G Protein-Coupled Receptor (GPCR)
Mol. Mass.:
44503.11
Organism:
Rattus norvegicus (rat)
Description:
Competition binding assays were carried out using membrane preparations from transfected HN9.10 cells that constitutively expressed the mu opioid receptor.
Residue:
398
  
Inhibitor
Name:
BDBM50085059
Synonyms:
CHEMBL406813 | H-D-Tca-c[Cys-Tyr-D-Trp-Arg-Thr-Pen]-Thr-NH2
Type:
Small organic molecule
Emp. Form.:
C47H63N13O11S3
Mol. Mass.:
1082.279
SMILES:
C[C@@H](O)[C@H](NC(=O)[C@@H]1NC(=O)[C@H](NC(=O)[C@H](CCCNC(N)=N)NC(=O)[C@H](Cc2c[nH]c3ccccc23)NC(=O)[C@H](Cc2ccc(O)cc2)NC(=O)[C@H](CSSC1(C)C)NC(=O)C1=CSCC=N1)[C@@H](C)O)C(N)=O
: