Target
Delta-type opioid receptor
Ligand
BDBM50085061
Substrate
Meas. Tech.
ChEMBL_146762 (CHEMBL755206)
IC50
3530±n/a nM
Citation
 Bonner, GGDavis, PStropova, DEdsall, SYamamura, HIPorreca, FHruby, VJ Opiate aromatic pharmacophore structure-activity relationships in CTAP analogues determined by topographical bias, two-dimensional NMR, and biological activity assays. J Med Chem 43:569-80 (2000)  
Target
Name:
Delta-type opioid receptor
Synonyms:
Cytochrome P450 3A4 Delta opioid receptor Delta-type opioid receptor (DOR) OPRD_RAT Opioid receptor Opioid receptors; mu & delta Ror-a | Voltage-gated potassium channel
Type:
G Protein-Coupled Receptor (GPCR)
Mol. Mass.:
40465.04
Organism:
Rattus norvegicus (rat)
Description:
Competition binding assays were using CHO-K1 cell membranes expressing the opioid receptor.
Residue:
372
  
Inhibitor
Name:
BDBM50085061
Synonyms:
CHEMBL384571 | H-D-Trp-c[Cys-Tyr-D-Trp-Arg-Thr-Pen]-Thr-NH2
Type:
Small organic molecule
Emp. Form.:
C53H70N14O11S2
Mol. Mass.:
1143.34
SMILES:
C[C@@H](O)[C@H](NC(=O)[C@@H]1NC(=O)[C@H](NC(=O)[C@H](CCCNC(N)=N)NC(=O)[C@H](Cc2c[nH]c3ccccc23)NC(=O)[C@H](Cc2ccc(O)cc2)NC(=O)[C@H](CSSC1(C)C)NC(=O)[C@H](N)Cc1c[nH]c2ccccc12)[C@@H](C)O)C(N)=O
: