Target
85/88 kDa calcium-independent phospholipase A2
Ligand
BDBM50055366
Substrate
Meas. Tech.
ChEMBL_1910994 (CHEMBL4413440)
IC50
104±n/a nM
Citation
 Mouchlis, VDArmando, ADennis, EA Substrate-Specific Inhibition Constants for Phospholipase A J Med Chem 62:1999-2007 (2019)  
Target
Name:
85/88 kDa calcium-independent phospholipase A2
Synonyms:
Calcium-independent phospholipase A2 PLPL9_HUMAN | PLPLA9
Type:
PROTEIN
Mol. Mass.:
89913.62
Organism:
Homo sapiens (Human)
Description:
ChEMBL_156048
Residue:
806
  
Inhibitor
Name:
BDBM50055366
Synonyms:
(3-Aminooxalyl-1-benzyl-2-ethyl-1H-indol-4-yloxy)-acetic acid 2-(3-(2-amino-2-oxoacetyl)-1-benzyl-2-ethyl-1H-indol-4-yloxy)acetic acid Varespladib sodium
Type:
Small organic molecule
Emp. Form.:
C21H20N2O5
Mol. Mass.:
380.3939
SMILES:
CCc1c(C(=O)C(N)=O)c2c(OCC(O)=O)cccc2n1Cc1ccccc1
: