Target
Cytochrome P450 2D6
Ligand
BDBM50122758
Substrate
Meas. Tech.
ChEMBL_1911029 (CHEMBL4413475)
IC50
60700±n/a nM
Citation
 Graziani, DCaligari, SCallegari, EDe Toma, CLonghi, MFrigerio, FDilernia, RMenegon, SPinzi, LPirona, LTazzari, VValsecchi, AEVistoli, GRastelli, GRiva, C Evaluation of Amides, Carbamates, Sulfonamides, and Ureas of 4-Prop-2-ynylidenecycloalkylamine as Potent, Selective, and Bioavailable Negative Allosteric Modulators of Metabotropic Glutamate Receptor 5. J Med Chem 62:1246-1273 (2019)  
Target
Name:
Cytochrome P450 2D6
Synonyms:
CP2D6_HUMAN CYP2DL1 Cytochrome P450 2D6 (CYP2D6) P450-DB1
Type:
Protein
Mol. Mass.:
55774.82
Organism:
Homo sapiens (Human)
Description:
P10635
Residue:
497
  
Inhibitor
Name:
BDBM50122758
Synonyms:
2-methyl-4-(pyridin-3-ylethynyl)thiazole 3-(2-Methyl-thiazol-4-ylethynyl)-pyridine 3-[(2-methyl-4-thiazolyl)ethynyl]pyridine MTEP
Type:
Small organic molecule
Emp. Form.:
C11H8N2S
Mol. Mass.:
200.26
SMILES:
Cc1nc(cs1)C#Cc1cccnc1
: