Target
High affinity cAMP-specific 3',5'-cyclic phosphodiesterase 7A
Ligand
BDBM50085148
Substrate
Meas. Tech.
ChEMBL_155539 (CHEMBL759744)
IC50
15000±n/a nM
Citation
 Martínez, ACastro, AGil, CMiralpeix, MSegarra, VDoménech, TBeleta, JPalacios, JMRyder, HMiró, XBonet, CCasacuberta, JMAzorín, FPiña, BPuigdoménech, P Benzyl derivatives of 2,1,3-benzo- and benzothieno[3,2-a]thiadiazine 2,2-dioxides: first phosphodiesterase 7 inhibitors. J Med Chem 43:683-9 (2000)  
Target
Name:
High affinity cAMP-specific 3',5'-cyclic phosphodiesterase 7A
Synonyms:
3',5'-cyclic phosphodiesterase PDE7A_HUMAN Phosphodiesterase 7 (PDE7) Phosphodiesterase 7A (PDE7A1)
Type:
Enzyme
Mol. Mass.:
55514.96
Organism:
Homo sapiens (Human)
Description:
Q13946
Residue:
482
  
Inhibitor
Name:
BDBM50085148
Synonyms:
4-Biphenyl-3-ylmethyl-3,3-dioxo-3,4-dihydro-2H-3lambda*6*,9-dithia-2,4-diaza-fluoren-1-one | CHEMBL160093
Type:
Small organic molecule
Emp. Form.:
C22H16N2O3S2
Mol. Mass.:
420.504
SMILES:
O=C1NS(=O)(=O)N(Cc2cccc(c2)-c2ccccc2)c2c1sc1ccccc21
: