Target
Receptor-type tyrosine-protein kinase FLT3
Ligand
BDBM50530205
Substrate
Meas. Tech.
ChEMBL_1911469 (CHEMBL4413915)
IC50
0.323594±n/a nM
Citation
 Grimm, SHGagestein, BKeijzer, JFLiu, NWijdeven, RHLenselink, EBTuin, AWvan den Nieuwendijk, AMCHvan Westen, GJPvan Boeckel, CAAOverkleeft, HSNeefjes, Jvan der Stelt, M Comprehensive structure-activity-relationship of azaindoles as highly potent FLT3 inhibitors. Bioorg Med Chem 27:692-699 (2019)  
Target
Name:
Receptor-type tyrosine-protein kinase FLT3
Synonyms:
CD135 FL cytokine receptor FLK2 FLT3 Fetal liver kinase-2 Fms-like tyrosine kinase 3 (Flt-3) STK-1 Stem cell tyrosine kinase 1
Type:
Enzyme
Mol. Mass.:
112888.62
Organism:
Homo sapiens (Human)
Description:
P36888
Residue:
993
  
Inhibitor
Name:
BDBM50530205
Synonyms:
CHEMBL4561847
Type:
Small organic molecule
Emp. Form.:
C24H24N4O3S
Mol. Mass.:
448.537
SMILES:
O=C(CCc1ccc(cc1)-c1cnc2[nH]ccc2c1)NCCNS(=O)(=O)c1ccccc1
: