Target
Tissue-type plasminogen activator
Ligand
BDBM50085393
Substrate
Meas. Tech.
ChEBML_225386
Ki
>8700±n/a nM
Citation
 Gong, YPauls, HWSpada, APCzekaj, MLiang, GChu, VColussi, DJBrown, KDGao, J Amido-(propyl and allyl)-hydroxybenzamidines: development of achiral inhibitors of factor Xa. Bioorg Med Chem Lett 10:217-21 (2000)  
Target
Name:
Tissue-type plasminogen activator
Synonyms:
Alteplase Reteplase Thrombin receptor protein Tissue-type plasminogen activator (tPA) t-PA t-plasminogen activator
Type:
Enzyme
Mol. Mass.:
62931.08
Organism:
Homo sapiens (Human)
Description:
Residue:
562
  
Inhibitor
Name:
BDBM50085393
Synonyms:
(2R,3R)-2-(3-Carbamimidoyl-benzyl)-3-[(3'-carbamoyl-biphenyl-4-carbonyl)-amino]-butyric acid methyl ester | CHEMBL44050
Type:
Small organic molecule
Emp. Form.:
C27H28N4O4
Mol. Mass.:
472.5356
SMILES:
COC(=O)[C@H](Cc1cccc(c1)C(N)=N)[C@@H](C)NC(=O)c1ccc(cc1)-c1cccc(c1)C(N)=O
: