Target
Sodium channel protein type 8 subunit alpha/subunit beta-1
Ligand
BDBM50530533
Substrate
Meas. Tech.
ChEMBL_1913271 (CHEMBL4415854)
IC50
20±n/a nM
Citation
 Focken, TBurford, KGrimwood, MEZenova, AAndrez, JCGong, WWilson, MTaron, MDecker, SLofstrand, VChowdhury, SShuart, NLin, SGoodchild, SJYoung, CSoriano, MTari, PKWaldbrook, MNelkenbrecher, KKwan, RLindgren, Ade Boer, GLee, SSojo, LDeVita, RJCohen, CJWesolowski, SSJohnson, JPDehnhardt, CMEmpfield, JR Identification of CNS-Penetrant Aryl Sulfonamides as Isoform-Selective Na J Med Chem 62:9618-9641 (2019)  
Target
Name:
Sodium channel protein type 8 subunit alpha/subunit beta-1
Synonyms:
SCN8A/SCN1B
Type:
Mol. Mass.:
Description:
ASSAY_ID of ChEMBL is 1913271
Components:
This complex has 2 components.
Component 1
Name:
Sodium channel protein type 8 subunit alpha
Synonyms:
MED SCN8A_HUMAN Sodium channel protein type 8 subunit alpha Voltage-gated sodium channel subunit alpha Nav1.6 | ep nav1.6
Type:
PROTEIN
Mol. Mass.:
225271.59
Organism:
Homo sapiens (Human)
Description:
ChEMBL_1516902
Residue:
1980
  
Component 2
Name:
Sodium channel subunit beta-1
Synonyms:
SCN1B Sodium channel subunit beta-1
Type:
PROTEIN
Mol. Mass.:
24696.80
Organism:
Homo sapiens
Description:
ChEMBL_119389
Residue:
218
  
Inhibitor
Name:
BDBM50530533
Synonyms:
CHEMBL4435054 | US11174268, Example 185
Type:
Small organic molecule
Emp. Form.:
C21H23F3N4O2S2
Mol. Mass.:
484.558
SMILES:
CC(C)N(C)Cc1cccc(F)c1CNc1cc(F)c(c(F)c1)S(=O)(=O)Nc1cscn1
: