Target
Adenosine receptor A1
Ligand
BDBM50086140
Substrate
Meas. Tech.
ChEMBL_29119 (CHEMBL642253)
Ki
1.43±n/a nM
Citation
 Colotta, VCatarzi, DVarano, FCecchi, LFilacchioni, GMartini, CTrincavelli, LLucacchini, A 1,2,4-Triazolo[4,3-a]quinoxalin-1-one: a versatile tool for the synthesis of potent and selective adenosine receptor antagonists. J Med Chem 43:1158-64 (2000)  
Target
Name:
Adenosine receptor A1
Synonyms:
AA1R_BOVIN ADENOSINE A1 high ADORA1 | Adenosine A1 receptor
Type:
Enzyme Catalytic Domain
Mol. Mass.:
36602.99
Organism:
BOVINE
Description:
ADENOSINE 0 BOVINE::P28190
Residue:
326
  
Inhibitor
Name:
BDBM50086140
Synonyms:
4-(cyclohexylamino)-2-phenyl-[1,2,4]triazolo[4,3-a]quinoxalin-1(2H)-one CHEMBL274267
Type:
Small organic molecule
Emp. Form.:
C21H21N5O
Mol. Mass.:
359.4243
SMILES:
O=c1n(nc2c(NC3CCCCC3)nc3ccccc3n12)-c1ccccc1
: